Update .gitlab-ci.yml

1 job for master in 2 minutes and 19 seconds (queued for 2 seconds)
Status Job ID Name Coverage
  Test
failed #632
build

00:02:19

 
Name Stage Failure
failed
build Test
                                    ^
compilation terminated.
CMakeFiles/blasSelfJoin.dir/build.make:86: recipe for target 'CMakeFiles/blasSelfJoin.dir/blasJoin/blasJoin.cpp.o' failed
make[2]: *** [CMakeFiles/blasSelfJoin.dir/blasJoin/blasJoin.cpp.o] Error 1
CMakeFiles/Makefile2:67: recipe for target 'CMakeFiles/blasSelfJoin.dir/all' failed
make[1]: *** [CMakeFiles/blasSelfJoin.dir/all] Error 2
Makefile:83: recipe for target 'all' failed
make: *** [all] Error 2
ERROR: Job failed: exit code 1